ADDRESS


EMAIL

PHONE

Error C3861 Exit Identifier Not Found Visual Studio

RECOMMENDED: If you have Windows errors then we strongly recommend that you download and run this (Windows) Repair Tool.

error C3861: 'rollDice': identifier not found. Ask Question. up vote 8 down vote favorite. C++ Visual studio 2012 error C3861: 'free': identifier not found-1.

Start Visual Studio. Hit F5 to run. CppClr.cpp(5): error C2653: ‘Console’ : is not a class or namespace name CppClr.cpp(5): error C3861: ‘WriteLine’: identifier not found CppClr.cpp(6): error C2653: ‘Console’ : is not a class or.

Visual Studio ProjectsRead GT ReportTarget.cpp(9) : error C3861: ‘IsClipboardFormatAvailable’: identifier not found, even with argument-dependent lookup.Visual Studio ProjectsRead GT ReportTarget.cpp(11) : error C3861:.

error C3861: 'snprintf. identifier not found in Visual Studio 2013 – by melnakeeb. Looks like snprintf and vsnprintf are now implemented in Visual Studio 14.

error C3861: ‘mxSetName’: identifier not found > > I have just started to use TrueTime. I am using Microsoft Visual Studio 2008 and MATLAB version of R2010a in Windows 7. The truetime version is TrueTime 1.5. > > I am having the.

xerces-c-3.0.0 + windows Mobile – DllMain’ : function cannot be overloaded c:Documents and SettingsmikaelMy DocumentsVisual Studio 2005ProjectsXercesLibXercesLibutilMsgLoadersWin32Win32MsgLoader.cpp 38 Error 2 error C3861:.

. identifier c:documents and settingsxcruisermy documentsvisual studio 2008projectsmyassignmentmyassignmentmyassignment.cpp(59) : error C3861: ‘exit’: identifier not found.

This is my first time using Visual Studio. error C3861: 'exit': identifier not found. stdlib.h is revealed and may lend clues as to why exit is not being.

Error Al Cargar Operation 7 In March 2003, Putin condemned the U.S. invasion of Iraq as a “great political error,” though he did not criticize the purpose of the operation, the removal of. where foreign jihadists, including al-Qaeda, appeared in the late 1990s. Stack Overflow is a community of 7.6 million programmers, just like you, helping each other. Join them;

Error 1 error C3861: ‘getline’:identifier not found c:usersalexdocumentsvisual studio2008projectscopalexch12_5.cpp 18 Error 2 error C2679: binary'<<‘ : no operator found which takes a right.

Oct 9, 2011. error C3861: 'exit': identifier not found, even with. This comes from an incompatibility error between the glut.h file, and Visual Studio's.

ok. i found my problem with code::blocks. whatever your second file is, you just have to goto the left tree window and right click your file (not the main) pick.

c++ – Why is exit(0) giving me errors? – Stack Overflow – Why is exit(0) giving me. Error 3 error C3861: 'exit': identifier not found. If your Visual Studio throws a build error saying IntelliSense did not identify.

This program prints “Hello, world!” to the console using cout. However, this program never defines cout, so how does the compiler know what cout is?

Compiler Errors C3500 through C3999 Compiler Error C3861. Visual Studio 2005. 'identifier': identifier not found.

2011년 3월 13일. C:Program FilesMicrosoft Visual Studio 8VCincludestdlib.h(406). sourceCodemain.cpp(362) : error C3861: 'exit': identifier not found.

. the project I am getting error "Error C3861:atof:Identifier not found. Enabling Windows XP visual effects before any controls are created

Visual Studio Error: 'exit': identifier not found. – After installing Visual Basic 2010, with the GLUT, and GLUI, I was having some trouble compiling a simple program, which would give an error: error C2381:…

RECOMMENDED: Click here to fix Windows errors and improve system performance