ADDRESS


EMAIL

PHONE

Gdb Error No Termcap Library Found

RECOMMENDED: If you have Windows errors then we strongly recommend that you download and run this (Windows) Repair Tool.

Virtual screening is becoming a ground-breaking tool for molecular discovery due to the exponential growth of available.

Mar 1, 2011. From apt-get or aptitude there's just termcap-compact, but I still see "no termcap library found" when trying to install my software (a development.

Hi: I am trying to build gdb on Fedora 14. I get an error: "no termcap library found" I have not been able to find a good answer by Googling.

Nov 21, 2012. For the case of embedded linux system, it is important have a version of GDB that can run in proper. configure: error: no termcap library found

make and then failed with: configure: error: no termcap library found, but that termcap lib is just there, why can't make find it? checking for library containing.

gdserver cross compilation failed => error: no termcap library. make && make DESTDIR=~/gdb-7.6/toInst. no configure: error: no termcap library found make.

Linux man pages: alphabetic list of all pages. Jump to letter:. 3 a b c d e f g h i j k l m n o p q r s t u v w x y z

Solved: Hi, I am getting "no termcap library found " while installing GNU GDB Debugger in my server. [root gdb-6.8]# cat /etc/redhat-release Red Hat

May 4, 2009. After compiling just copy gdb/gdbserver/gdbserver to your arm-linux filesystem so that you can. configure: error: no termcap library found

this feature is not used when building the library./a.out: error while loading shared libraries: libstdc++.so.6: cannot open shared object file: No such file or directory /usr/libexec/ld-elf.so.1: Shared object "libstdc++.so.6" not found This.

CVE (version 20061101) and Candidates as of 20170926 Candidates must be reviewed and accepted by the CVE Editorial Board before they can be added to the official CVE.

[SOLVED] Cross-compilation shows>error: no termcap library found. – I'm experiencing a frustrating error trying to cross-compile gdbserver for arm. I've downloaded and crosscompiled termcap with this command.

Error Final Fantasy Viii Completely remove McAfee and after that verify integrity of game cache. Switch to better antivirus program. +1 Cant get this game to run without getting this error. There is no way to run in administrator mode, let alone even start the game. There is also. In fact, this may be the most “Final Fantasy” game
Ldap Error Code 12 – Unavailable Critical Extension Aug 31, 2017  · Error / Data Code Error Description 0 LDAP_SUCCESS Indicates the requested client operation completed successfully. 1 LDAP_OPERATIONS_ERROR. LDAP_UNAVAILABLE_CRITICAL_EXTENSION: Indicates that the LDAP server was unable to satisfy a request because one or more critical extensions were not available. Advertisement Earlier this week, the credit reporting firm explained that hackers were able to

Hi: I am trying to build gdb on Fedora 14. I get an error: "no termcap library found" I have not been able to find a good answer by Googling.

You are allowed to write OpenCOBOL programs that use the libcob run time library however you like. Closed, proprietary, commercial use is allowed and encouraged.

Feb 13, 2007. Supriya Sriraman wrote: > I am getting "no termcap library found" error when I was building GDB > 6.6, for a powerpc target. > The host and.

RECOMMENDED: Click here to fix Windows errors and improve system performance